Reaction Details
TargetProthrombin
LigandBDBM50079252
Substrate/Competitorn/a
Meas. Tech.ChEBML_209232
Ki 2400±n/a nM
Citation Pruitt, JRPinto, DJEstrella, MJBostrom, LLKnabb, RMWong, PCWright, MRWexler, RR Isoxazolines and isoxazoles as factor Xa inhibitors. Bioorg Med Chem Lett10:685-9 (2000) Prothrombin
Name:Prothrombin
Type:Protein
Mol. Mass.:70029.57
Organism:Homo sapiens (Human)
Description:P00734
Residue:622
BDBM50079252
NameBDBM50079252
Synonyms:3-(3-Carbamimidoyl-phenyl)-5-methoxymethyl-4,5-dihydro-isoxazole-5-carboxylic acid (2'-sulfamoyl-biphenyl-4-yl)-amide; TFA CHEMBL350499
TypeSmall organic molecule
Emp. Form.C25H25N5O5S
Mol. Mass.507.562
SMILESCOCC1(CC(=NO1)c1cccc(c1)C(N)=N)C(=O)Nc1ccc(cc1)-c1ccccc1S(N)(=O)=O