Reaction Details
TargetProthrombin
LigandBDBM50087535
Substrate/Competitorn/a
Meas. Tech.ChEBML_209232
Ki 12000±n/a nM
Citation Pruitt, JRPinto, DJEstrella, MJBostrom, LLKnabb, RMWong, PCWright, MRWexler, RR Isoxazolines and isoxazoles as factor Xa inhibitors. Bioorg Med Chem Lett10:685-9 (2000) Prothrombin
Name:Prothrombin
Type:Protein
Mol. Mass.:70029.57
Organism:Homo sapiens (Human)
Description:P00734
Residue:622
BDBM50087535
NameBDBM50087535
Synonyms:3-(3-Carbamimidoyl-phenyl)-5-methoxymethyl-isoxazole-4-carboxylic acid [5-(2-sulfamoyl-phenyl)-pyridin-2-yl]-amide | CHEMBL160115
TypeSmall organic molecule
Emp. Form.C24H22N6O5S
Mol. Mass.506.534
SMILESCOCc1onc(c1C(=O)Nc1ccc(cn1)-c1ccccc1S(N)(=O)=O)-c1cccc(c1)C(N)=N