Reaction Details
TargetG protein-activated inward rectifier potassium channel 4
LigandBDBM50532034
Substrate/Competitorn/a
Meas. Tech.ChEMBL_1921816 (CHEMBL4424661)
EC50 383±n/a nM
Citation Sharma, SKozek, KAAbney, KKKumar, SGautam, NAlnouti, YDavid Weaver, CHopkins, CR Discovery, synthesis and characterization of a series of (1-alkyl-3-methyl-1H-pyrazol-5-yl)-2-(5-aryl-2H-tetrazol-2-yl)acetamides as novel GIRK1/2 potassium channel activators. Bioorg Med Chem Lett29:791-796 (2019) 
 
G protein-activated inward rectifier potassium channel 4
Name:G protein-activated inward rectifier potassium channel 4
Type:PROTEIN
Mol. Mass.:47658.06
Organism:Homo sapiens (Human)
Description:ChEMBL_107914
Residue:419
BDBM50532034
NameBDBM50532034
Synonyms:CHEMBL4435859
TypeSmall organic molecule
Emp. Form.C19H21F2N7O
Mol. Mass.401.4131
SMILESCc1cc(NC(=O)Cn2nnc(n2)-c2ccccc2)n(n1)C1CCC(F)(F)CC1