Reaction Details
TargetG protein-activated inward rectifier potassium channel 4
LigandBDBM50532041
Substrate/Competitorn/a
Meas. Tech.ChEMBL_1921816 (CHEMBL4424661)
EC50 299±n/a nM
Citation Sharma, SKozek, KAAbney, KKKumar, SGautam, NAlnouti, YDavid Weaver, CHopkins, CR Discovery, synthesis and characterization of a series of (1-alkyl-3-methyl-1H-pyrazol-5-yl)-2-(5-aryl-2H-tetrazol-2-yl)acetamides as novel GIRK1/2 potassium channel activators. Bioorg Med Chem Lett29:791-796 (2019) 
 
G protein-activated inward rectifier potassium channel 4
Name:G protein-activated inward rectifier potassium channel 4
Type:PROTEIN
Mol. Mass.:47658.06
Organism:Homo sapiens (Human)
Description:ChEMBL_107914
Residue:419
BDBM50532041
NameBDBM50532041
Synonyms:CHEMBL4447978
TypeSmall organic molecule
Emp. Form.C20H25N7O2
Mol. Mass.395.4582
SMILESCOc1cccc(c1)-c1nnn(CC(=O)Nc2cc(C)nn2C2CCCCC2)n1