Reaction Details
TargetGenome polyprotein
LigandBDBM50087767
Substrate/Competitorn/a
Meas. Tech.ChEMBL_160906 (CHEMBL771802)
Ki 1500±n/a nM
Citation Reich, SHJohnson, TWallace, MBKephart, SEFuhrman, SAWorland, STMatthews, DAHendrickson, TFChan, FMeador, JFerre, RABrown, ELDeLisle, DMPatick, AKBinford, SLFord, CE Substituted benzamide inhibitors of human rhinovirus 3C protease: structure-based design, synthesis, and biological evaluation. J Med Chem43:1670-83 (2000) Genome polyprotein
Name:Genome polyprotein
Type:PROTEIN
Mol. Mass.:44361.04
Organism:Human rhinovirus B
Description:ChEMBL_158953
Residue:401
BDBM50087767
NameBDBM50087767
Synonyms:3-(3-Carbamoyl-phenyl)-2-cyano-acrylic acid ethyl ester | CHEMBL296741
TypeSmall organic molecule
Emp. Form.C13H12N2O3
Mol. Mass.244.246
SMILESCCOC(=O)C(=C\c1cccc(c1)C(N)=O)\C#N