Reaction Details
TargetGenome polyprotein
LigandBDBM50087772
Substrate/Competitorn/a
Meas. Tech.ChEMBL_160905 (CHEMBL771801)
Ki 1800±n/a nM
Citation Reich, SHJohnson, TWallace, MBKephart, SEFuhrman, SAWorland, STMatthews, DAHendrickson, TFChan, FMeador, JFerre, RABrown, ELDeLisle, DMPatick, AKBinford, SLFord, CE Substituted benzamide inhibitors of human rhinovirus 3C protease: structure-based design, synthesis, and biological evaluation. J Med Chem43:1670-83 (2000) Genome polyprotein
Name:Genome polyprotein
Type:PROTEIN
Mol. Mass.:44361.04
Organism:Human rhinovirus B
Description:ChEMBL_158953
Residue:401
BDBM50087772
NameBDBM50087772
Synonyms:3-[3-(4-Methoxy-phenyl)-3-oxo-propenyl]-benzamide | CHEMBL43785
TypeSmall organic molecule
Emp. Form.C17H15NO3
Mol. Mass.281.3059
SMILESCOc1ccc(cc1)C(=O)\C=C\c1cccc(c1)C(N)=O