Reaction Details
TargetGenome polyprotein
LigandBDBM50087770
Substrate/Competitorn/a
Meas. Tech.ChEMBL_160905 (CHEMBL771801)
Ki 1800±n/a nM
Citation Reich, SHJohnson, TWallace, MBKephart, SEFuhrman, SAWorland, STMatthews, DAHendrickson, TFChan, FMeador, JFerre, RABrown, ELDeLisle, DMPatick, AKBinford, SLFord, CE Substituted benzamide inhibitors of human rhinovirus 3C protease: structure-based design, synthesis, and biological evaluation. J Med Chem43:1670-83 (2000) Genome polyprotein
Name:Genome polyprotein
Type:PROTEIN
Mol. Mass.:44361.04
Organism:Human rhinovirus B
Description:ChEMBL_158953
Residue:401
BDBM50087770
NameBDBM50087770
Synonyms:3-(3-Oxo-3-pyridin-2-yl-propenyl)-benzamide | CHEMBL417715
TypeSmall organic molecule
Emp. Form.C15H12N2O2
Mol. Mass.252.268
SMILESNC(=O)c1cccc(\C=C\C(=O)c2ccccn2)c1