Reaction Details
TargetGenome polyprotein
LigandBDBM50087780
Substrate/Competitorn/a
Meas. Tech.ChEMBL_76921 (CHEMBL688665)
EC50 28000±n/a nM
Citation Reich, SHJohnson, TWallace, MBKephart, SEFuhrman, SAWorland, STMatthews, DAHendrickson, TFChan, FMeador, JFerre, RABrown, ELDeLisle, DMPatick, AKBinford, SLFord, CE Substituted benzamide inhibitors of human rhinovirus 3C protease: structure-based design, synthesis, and biological evaluation. J Med Chem43:1670-83 (2000) Genome polyprotein
Name:Genome polyprotein
Type:PROTEIN
Mol. Mass.:44361.04
Organism:Human rhinovirus B
Description:ChEMBL_158953
Residue:401
BDBM50087780
NameBDBM50087780
Synonyms:3-(3-Oxo-3-phenyl-propenyl)-benzamide | CHEMBL294981
TypeSmall organic molecule
Emp. Form.C16H13NO2
Mol. Mass.251.2799
SMILESNC(=O)c1cccc(\C=C\C(=O)c2ccccc2)c1