Reaction Details
TargetAmine oxidase [flavin-containing] A
LigandBDBM50087793
Substrate/Competitorn/a
Meas. Tech.ChEMBL_123446 (CHEMBL731837)
Ki 262000±n/a nM
Citation Morón, JACampillo, MPerez, VUnzeta, MPardo, L Molecular determinants of MAO selectivity in a series of indolylmethylamine derivatives: biological activities, 3D-QSAR/CoMFA analysis, and computational simulation of ligand recognition. J Med Chem43:1684-91 (2000) Amine oxidase [flavin-containing] A
Name:Amine oxidase [flavin-containing] A
Type:Enzyme
Mol. Mass.:59515.21
Organism:Rattus norvegicus (rat)
Description:n/a
Residue:526
BDBM50087793
NameBDBM50087793
Synonyms:(1-Benzyl-1H-indol-3-ylmethyl)-ethyl-amine | CHEMBL44487
TypeSmall organic molecule
Emp. Form.C18H20N2
Mol. Mass.264.3648
SMILESCCNCc1cn(Cc2ccccc2)c2ccccc12