Reaction Details
TargetAmine oxidase [flavin-containing] B
LigandBDBM50087800
Substrate/Competitorn/a
Meas. Tech.ChEMBL_124404 (CHEMBL878130)
Ki 0.75±n/a nM
Citation Morón, JACampillo, MPerez, VUnzeta, MPardo, L Molecular determinants of MAO selectivity in a series of indolylmethylamine derivatives: biological activities, 3D-QSAR/CoMFA analysis, and computational simulation of ligand recognition. J Med Chem43:1684-91 (2000) Amine oxidase [flavin-containing] B
Name:Amine oxidase [flavin-containing] B
Type:Enzyme
Mol. Mass.:58469.65
Organism:Rattus norvegicus (rat)
Description:P19643
Residue:520
BDBM50087800
NameBDBM50087800
Synonyms:(5-Benzyloxy-1H-indol-2-ylmethyl)-prop-2-ynyl-amine | CHEMBL45069
TypeSmall organic molecule
Emp. Form.C19H18N2O
Mol. Mass.290.359
SMILESC#CCNCc1cc2cc(OCc3ccccc3)ccc2[nH]1