Reaction Details
TargetAmine oxidase [flavin-containing] A
LigandBDBM50087796
Substrate/Competitorn/a
Meas. Tech.ChEMBL_123446 (CHEMBL731837)
Ki 0.8±n/a nM
Citation Morón, JACampillo, MPerez, VUnzeta, MPardo, L Molecular determinants of MAO selectivity in a series of indolylmethylamine derivatives: biological activities, 3D-QSAR/CoMFA analysis, and computational simulation of ligand recognition. J Med Chem43:1684-91 (2000) Amine oxidase [flavin-containing] A
Name:Amine oxidase [flavin-containing] A
Type:Enzyme
Mol. Mass.:59515.21
Organism:Rattus norvegicus (rat)
Description:n/a
Residue:526
BDBM50087796
NameBDBM50087796
Synonyms:(5-Methoxy-1-methyl-1H-indol-2-ylmethyl)-prop-2-ynyl-amine | CHEMBL46952
TypeSmall organic molecule
Emp. Form.C14H16N2O
Mol. Mass.228.2896
SMILESCOc1ccc2n(C)c(CNCC#C)cc2c1