Reaction Details
TargetAmine oxidase [flavin-containing] A
LigandBDBM50087809
Substrate/Competitorn/a
Meas. Tech.ChEMBL_123446 (CHEMBL731837)
Ki 0.3±n/a nM
Citation Morón, JACampillo, MPerez, VUnzeta, MPardo, L Molecular determinants of MAO selectivity in a series of indolylmethylamine derivatives: biological activities, 3D-QSAR/CoMFA analysis, and computational simulation of ligand recognition. J Med Chem43:1684-91 (2000) Amine oxidase [flavin-containing] A
Name:Amine oxidase [flavin-containing] A
Type:Enzyme
Mol. Mass.:59515.21
Organism:Rattus norvegicus (rat)
Description:n/a
Residue:526
BDBM50087809
NameBDBM50087809
Synonyms:CHEMBL298006 | Methyl-(1-methyl-1H-indol-2-ylmethyl)-prop-2-ynyl-amine (FA27)
TypeSmall organic molecule
Emp. Form.C14H16N2
Mol. Mass.212.2902
SMILESCN(CC#C)Cc1cc2ccccc2n1C