Reaction Details
TargetAmine oxidase [flavin-containing] A
LigandBDBM50087805
Substrate/Competitorn/a
Meas. Tech.ChEMBL_123446 (CHEMBL731837)
Ki 160000±n/a nM
Citation Morón, JACampillo, MPerez, VUnzeta, MPardo, L Molecular determinants of MAO selectivity in a series of indolylmethylamine derivatives: biological activities, 3D-QSAR/CoMFA analysis, and computational simulation of ligand recognition. J Med Chem43:1684-91 (2000) Amine oxidase [flavin-containing] A
Name:Amine oxidase [flavin-containing] A
Type:Enzyme
Mol. Mass.:59515.21
Organism:Rattus norvegicus (rat)
Description:n/a
Residue:526
BDBM50087805
NameBDBM50087805
Synonyms:(1-Benzyl-1H-indol-3-ylmethyl)-methyl-prop-2-ynyl-amine | CHEMBL43727
TypeSmall organic molecule
Emp. Form.C20H20N2
Mol. Mass.288.3862
SMILESCN(CC#C)Cc1cn(Cc2ccccc2)c2ccccc12