Reaction Details
TargetInterstitial collagenase
LigandBDBM50088118
Substrate/Competitorn/a
Meas. Tech.ChEMBL_106145 (CHEMBL718692)
Ki 3±n/a nM
Citation Scozzafava, ASupuran, CT Protease inhibitors: synthesis of potent bacterial collagenase and matrix metalloproteinase inhibitors incorporating N-4-nitrobenzylsulfonylglycine hydroxamate moieties. J Med Chem43:1858-65 (2000) Interstitial collagenase
Name:Interstitial collagenase
Type:Enzyme
Mol. Mass.:54010.26
Organism:Homo sapiens (Human)
Description: P03956
Residue:469
BDBM50088118
NameBDBM50088118
Synonyms:2-(N-(4-nitrobenzyl)-2,3,4,5,6-pentafluorophenylsulfonamido)-N-hydroxyacetamide N-Hydroxy-2-[(4-nitro-benzyl)-pentafluorobenzenesulfonyl-amino]-acetamide
TypeSmall organic molecule
Emp. Form.C15H10F5N3O6S
Mol. Mass.455.313
SMILESONC(=O)CN(Cc1ccc(cc1)[N+]([O-])=O)S(=O)(=O)c1c(F)c(F)c(F)c(F)c1F