Reaction Details
TargetGag-Pol polyprotein [489-587]
LigandBDBM50088251
Substrate/Competitorn/a
Meas. Tech.ChEMBL_90555 (CHEMBL699597)
IC50 3140±n/a nM
Citation Molteni, VRhodes, DRubins, KHansen, MBushman, FDSiegel, JS A new class of HIV-1 integrase inhibitors: the 3,3,3', 3'-tetramethyl-1,1'-spirobi(indan)-5,5',6,6'-tetrol family. J Med Chem43:2031-9 (2000) Gag-Pol polyprotein [489-587]
Name:Gag-Pol polyprotein [489-587]
Type:Enzyme Subunit
Mol. Mass.:10781.16
Organism:Human immunodeficiency virus type 1
Description:P04585[489-587]
Residue:99
BDBM50088251
NameBDBM50088251
Synonyms:4,4',7,7'-tetrabromo-3,3,3',3'-tetramethyl-1,1'-spirobi[2,3-dihydro-1H-indene]-5,5',6,6'-tetraol | CHEMBL65504
TypeSmall organic molecule
Emp. Form.C21H20Br4O4
Mol. Mass.655.997
SMILESCC1(C)CC2(CC(C)(C)c3c2c(Br)c(O)c(O)c3Br)c2c1c(Br)c(O)c(O)c2Br