Reaction Details
TargetCannabinoid receptor 1
LigandBDBM50532438
Substrate/Competitorn/a
Meas. Tech.ChEMBL_1923180 (CHEMBL4426136)
Ki 19±n/a nM
Citation Morales, PGómez-Cañas, MNavarro, GHurst, DPCarrillo-Salinas, FJLagartera, LPazos, RGoya, PReggio, PHGuaza, CFranco, RFernández-Ruiz, JJagerovic, N Chromenopyrazole, a Versatile Cannabinoid Scaffold with in Vivo Activity in a Model of Multiple Sclerosis. J Med Chem59:6753-6771 (2016) 
 
Cannabinoid receptor 1
Name:Cannabinoid receptor 1
Type:G Protein-Coupled Receptor (GPCR)
Mol. Mass.:52868.96
Organism:Homo sapiens (Human)
Description:P21554
Residue:472
BDBM50532438
NameBDBM50532438
Synonyms:CHEMBL4441649
TypeSmall organic molecule
Emp. Form.C23H34N2O3
Mol. Mass.386.5277
SMILESCCCCCCC(C)(C)c1cc(O)c2-c3c(cnn3CCO)C(C)(C)Oc2c1