Reaction Details
TargetCannabinoid receptor 2
LigandBDBM50532442
Substrate/Competitorn/a
Meas. Tech.ChEMBL_1923181 (CHEMBL4426137)
Ki 13±n/a nM
Citation Morales, PGómez-Cañas, MNavarro, GHurst, DPCarrillo-Salinas, FJLagartera, LPazos, RGoya, PReggio, PHGuaza, CFranco, RFernández-Ruiz, JJagerovic, N Chromenopyrazole, a Versatile Cannabinoid Scaffold with in Vivo Activity in a Model of Multiple Sclerosis. J Med Chem59:6753-6771 (2016) 
 
Cannabinoid receptor 2
Name:Cannabinoid receptor 2
Type:G Protein-Coupled Receptor (GPCR)
Mol. Mass.:39690.94
Organism:Homo sapiens (Human)
Description:P34972
Residue:360
BDBM50532442
NameBDBM50532442
Synonyms:CHEMBL4444725
TypeSmall organic molecule
Emp. Form.C22H31NO3
Mol. Mass.357.4864
SMILESCCCCCCC(C)(C)c1cc(OC)c2-c3oncc3C(C)(C)Oc2c1