Reaction Details
TargetCannabinoid receptor 2
LigandBDBM50532448
Substrate/Competitorn/a
Meas. Tech.ChEMBL_1923181 (CHEMBL4426137)
Ki 40±n/a nM
Citation Morales, PGómez-Cañas, MNavarro, GHurst, DPCarrillo-Salinas, FJLagartera, LPazos, RGoya, PReggio, PHGuaza, CFranco, RFernández-Ruiz, JJagerovic, N Chromenopyrazole, a Versatile Cannabinoid Scaffold with in Vivo Activity in a Model of Multiple Sclerosis. J Med Chem59:6753-6771 (2016) 
 
Cannabinoid receptor 2
Name:Cannabinoid receptor 2
Type:G Protein-Coupled Receptor (GPCR)
Mol. Mass.:39690.94
Organism:Homo sapiens (Human)
Description:P34972
Residue:360
BDBM50532448
NameBDBM50532448
Synonyms:CHEMBL4475298
TypeSmall organic molecule
Emp. Form.C24H36N2O3
Mol. Mass.400.5542
SMILESCCCCCCC(C)(C)c1cc(OCCO)c2-c3nn(C)cc3C(C)(C)Oc2c1