Reaction Details
TargetCannabinoid receptor 1
LigandBDBM50532467
Substrate/Competitorn/a
Meas. Tech.ChEMBL_1923180 (CHEMBL4426136)
Ki 14±n/a nM
Citation Morales, PGómez-Cañas, MNavarro, GHurst, DPCarrillo-Salinas, FJLagartera, LPazos, RGoya, PReggio, PHGuaza, CFranco, RFernández-Ruiz, JJagerovic, N Chromenopyrazole, a Versatile Cannabinoid Scaffold with in Vivo Activity in a Model of Multiple Sclerosis. J Med Chem59:6753-6771 (2016) 
 
Cannabinoid receptor 1
Name:Cannabinoid receptor 1
Type:G Protein-Coupled Receptor (GPCR)
Mol. Mass.:52868.96
Organism:Homo sapiens (Human)
Description:P21554
Residue:472
BDBM50532467
NameBDBM50532467
Synonyms:CHEMBL4467761
TypeSmall organic molecule
Emp. Form.C22H32N2O2
Mol. Mass.356.5017
SMILESCCCCCCC(C)(C)c1cc(O)c2-c3nn(C)cc3C(C)(C)Oc2c1