Reaction Details
TargetMu-type opioid receptor
LigandBDBM50088370
Substrate/Competitorn/a
Meas. Tech.ChEMBL_148995 (CHEMBL757979)
Ki 25±n/a nM
Citation Vianello, PAlbinati, APinna, GALavecchia, AMarinelli, LBorea, PAGessi, SFadda, PTronci, SCignarella, G Synthesis, molecular modeling, and opioid receptor affinity of 9, 10-diazatricyclo[4.2.1.1(2,5)]decanes and 2,7-diazatricyclo[4.4.0. 0(3,8)]decanes structurally related to 3,8-diazabicyclo[3.2. 1]octanes. J Med Chem43:2115-23 (2000) Mu-type opioid receptor
Name:Mu-type opioid receptor
Type:G Protein-Coupled Receptor (GPCR)
Mol. Mass.:44503.11
Organism:Rattus norvegicus (rat)
Description:Competition binding assays were carried out using membrane preparations from transfected HN9.10 cells that constitutively expressed the mu opioid receptor.
Residue:398
BDBM50088370
NameBDBM50088370
Synonyms:1-{10-[3-(4-Nitro-phenyl)-allyl]-9,10-diaza-tricyclo[4.2.1.1*2,5*]dec-9-yl}-propan-1-one | CHEMBL304679
TypeSmall organic molecule
Emp. Form.C20H25N3O3
Mol. Mass.355.4308
SMILESCCC(=O)N1C2CC[C@H]1[C@@H]1CCC2N1C\C=C\c1ccc(cc1)[N+]([O-])=O