Reaction Details
TargetAdenosine receptor A2a
LigandBDBM21190
Substrate/Competitorn/a
Meas. Tech.ChEMBL_1923341 (CHEMBL4426297)
Ki 0.400000±n/a nM
Citation Segala, EGuo, DCheng, RKBortolato, ADeflorian, FDoré, ASErrey, JCHeitman, LHIJzerman, APMarshall, FHCooke, RM Controlling the Dissociation of Ligands from the Adenosine A2A Receptor through Modulation of Salt Bridge Strength. J Med Chem59:6470-9 (2016) 
 
Adenosine receptor A2a
Name:Adenosine receptor A2a
Type:G Protein-Coupled Receptor (GPCR)
Mol. Mass.:44716.46
Organism:Homo sapiens (Human)
Description:P29274
Residue:412
BDBM21190
NameBDBM21190
Synonyms:4-(2-{[5-amino-2-(furan-2-yl)-[1,2,4]triazolo[1,5-a][1,3,5]triazin-7-yl]amino}ethyl)phenol ZM 241385 [3H]-ZM241385
TypeSmall organic molecule
Emp. Form.C16H15N7O2
Mol. Mass.337.336
SMILESNc1nc(NCCc2ccc(O)cc2)nc2nc(nn12)-c1ccco1