Reaction Details
TargetAdenosine receptor A2a
LigandBDBM50152237
Substrate/Competitorn/a
Meas. Tech.ChEMBL_1923341 (CHEMBL4426297)
Ki 1.3±n/a nM
Citation Segala, EGuo, DCheng, RKBortolato, ADeflorian, FDoré, ASErrey, JCHeitman, LHIJzerman, APMarshall, FHCooke, RM Controlling the Dissociation of Ligands from the Adenosine A2A Receptor through Modulation of Salt Bridge Strength. J Med Chem59:6470-9 (2016) 
 
Adenosine receptor A2a
Name:Adenosine receptor A2a
Type:G Protein-Coupled Receptor (GPCR)
Mol. Mass.:44716.46
Organism:Homo sapiens (Human)
Description:P29274
Residue:412
BDBM50152237
NameBDBM50152237
Synonyms:2-Furan-2-yl-N*5*-[3-(4-phenyl-piperazin-1-yl)-propyl]-[1,2,4]triazolo[1,5-a][1,3,5]triazine-5,7-diamine | CHEMBL187810
TypeSmall organic molecule
Emp. Form.C21H25N9O
Mol. Mass.419.4829
SMILESNc1nc(NCCCN2CCN(CC2)c2ccccc2)nc2nc(nn12)-c1ccco1