Reaction Details
TargetAlpha-1A adrenergic receptor
LigandBDBM50088401
Substrate/Competitorn/a
Meas. Tech.ChEMBL_33612 (CHEMBL652819)
Ki 0.77±n/a nM
Citation Kuo, GHProuty, CMurray, WVPulito, VJolliffe, LCheung, PVarga, SEvangelisto, MWang, J Design, synthesis, and structure-activity relationships of phthalimide-phenylpiperazines: a novel series of potent and selective alpha(1)(a)-adrenergic receptor antagonists. J Med Chem43:2183-95 (2000) Alpha-1A adrenergic receptor
Name:Alpha-1A adrenergic receptor
Type:Cell-surface receptors
Mol. Mass.:51511.67
Organism:Homo sapiens (Human)
Description:P35348
Residue:466
BDBM50088401
NameBDBM50088401
Synonyms:2-(4-Methoxy-phenyl)-1,3-dioxo-2,3-dihydro-1H-isoindole-5-carboxylic acid {2-hydroxy-3-[4-(2-isopropoxy-phenyl)-piperazin-1-yl]-propyl}-amide | CHEMBL302940
TypeSmall organic molecule
Emp. Form.C32H36N4O6
Mol. Mass.572.6514
SMILESCOc1ccc(cc1)N1C(=O)c2ccc(cc2C1=O)C(=O)NCC(O)CN1CCN(CC1)c1ccccc1OC(C)C