Reaction Details
TargetAlpha-1D adrenergic receptor
LigandBDBM50088389
Substrate/Competitorn/a
Meas. Tech.ChEMBL_32438 (CHEMBL646099)
Ki 15±n/a nM
Citation Kuo, GHProuty, CMurray, WVPulito, VJolliffe, LCheung, PVarga, SEvangelisto, MWang, J Design, synthesis, and structure-activity relationships of phthalimide-phenylpiperazines: a novel series of potent and selective alpha(1)(a)-adrenergic receptor antagonists. J Med Chem43:2183-95 (2000) Alpha-1D adrenergic receptor
Name:Alpha-1D adrenergic receptor
Type:Enzyme Catalytic Domain
Mol. Mass.:60485.82
Organism:Homo sapiens (Human)
Description:adrenergic Alpha1D ADRA1D HUMAN::P25100
Residue:572
BDBM50088389
NameBDBM50088389
Synonyms:2-(4-Dimethylamino-phenyl)-1,3-dioxo-2,3-dihydro-1H-isoindole-5-carboxylic acid {3-[4-(2-isopropoxy-phenyl)-piperazin-1-yl]-propyl}-amide | CHEMBL69264
TypeSmall organic molecule
Emp. Form.C33H39N5O4
Mol. Mass.569.6939
SMILESCC(C)Oc1ccccc1N1CCN(CCCNC(=O)c2ccc3C(=O)N(C(=O)c3c2)c2ccc(cc2)N(C)C)CC1