Reaction Details
TargetAlpha-1A adrenergic receptor
LigandBDBM50088409
Substrate/Competitorn/a
Meas. Tech.ChEMBL_33612 (CHEMBL652819)
Ki 0.2±n/a nM
Citation Kuo, GHProuty, CMurray, WVPulito, VJolliffe, LCheung, PVarga, SEvangelisto, MWang, J Design, synthesis, and structure-activity relationships of phthalimide-phenylpiperazines: a novel series of potent and selective alpha(1)(a)-adrenergic receptor antagonists. J Med Chem43:2183-95 (2000) Alpha-1A adrenergic receptor
Name:Alpha-1A adrenergic receptor
Type:Cell-surface receptors
Mol. Mass.:51511.67
Organism:Homo sapiens (Human)
Description:P35348
Residue:466
BDBM50088409
NameBDBM50088409
Synonyms:2-(4-Hydroxy-phenyl)-1,3-dioxo-2,3-dihydro-1H-isoindole-5-carboxylic acid {3-[4-(2-isopropoxy-phenyl)-piperazin-1-yl]-propyl}-amide | CHEMBL70892
TypeSmall organic molecule
Emp. Form.C31H34N4O5
Mol. Mass.542.6255
SMILESCC(C)Oc1ccccc1N1CCN(CCCNC(=O)c2ccc3C(=O)N(C(=O)c3c2)c2ccc(O)cc2)CC1