Reaction Details
TargetD(2) dopamine receptor
LigandBDBM50060964
Substrate/Competitorn/a
Meas. Tech.ChEMBL_61615 (CHEMBL672912)
Ki 13±n/a nM
Citation Kuo, GHProuty, CMurray, WVPulito, VJolliffe, LCheung, PVarga, SEvangelisto, MWang, J Design, synthesis, and structure-activity relationships of phthalimide-phenylpiperazines: a novel series of potent and selective alpha(1)(a)-adrenergic receptor antagonists. J Med Chem43:2183-95 (2000) D(2) dopamine receptor
Name:D(2) dopamine receptor
Type:Cell-surface receptors
Mol. Mass.:50647.10
Organism:Homo sapiens (Human)
Description:P14416
Residue:443
BDBM50060964
NameBDBM50060964
Synonyms:(R)-5-(2-((2-(2-ethoxyphenoxy)ethyl)amino)propyl)-2-methoxybenzenesulfonamide 5-[2-[2-(2-ethoxyphenoxy)ethylamino]propyl]-2-methoxy-benzenesulfonamide TAMSULOSIN
TypeSmall organic molecule
Emp. Form.C20H28N2O5S
Mol. Mass.408.512
SMILESCCOc1ccccc1OCCN[C@H](C)Cc1ccc(OC)c(c1)S(N)(=O)=O