Reaction Details
TargetAlpha-1D adrenergic receptor
LigandBDBM50088407
Substrate/Competitorn/a
Meas. Tech.ChEMBL_32438 (CHEMBL646099)
Ki 75±n/a nM
Citation Kuo, GHProuty, CMurray, WVPulito, VJolliffe, LCheung, PVarga, SEvangelisto, MWang, J Design, synthesis, and structure-activity relationships of phthalimide-phenylpiperazines: a novel series of potent and selective alpha(1)(a)-adrenergic receptor antagonists. J Med Chem43:2183-95 (2000) Alpha-1D adrenergic receptor
Name:Alpha-1D adrenergic receptor
Type:Enzyme Catalytic Domain
Mol. Mass.:60485.82
Organism:Homo sapiens (Human)
Description:adrenergic Alpha1D ADRA1D HUMAN::P25100
Residue:572
BDBM50088407
NameBDBM50088407
Synonyms:2-(3-Fluoro-phenyl)-1,3-dioxo-2,3-dihydro-1H-isoindole-5-carboxylic acid {2-hydroxy-3-[4-(2-isopropoxy-phenyl)-piperazin-1-yl]-propyl}-amide | CHEMBL302246
TypeSmall organic molecule
Emp. Form.C31H33FN4O5
Mol. Mass.560.6159
SMILESCC(C)Oc1ccccc1N1CCN(CC(O)CNC(=O)c2ccc3C(=O)N(C(=O)c3c2)c2cccc(F)c2)CC1