Reaction Details
Target5-hydroxytryptamine receptor 1A
LigandBDBM10755
Substrate/Competitorn/a
Meas. Tech.ChEMBL_1924067 (CHEMBL4427023)
Ki 0.910000±n/a nM
Citation Intagliata, SModica, MNPittalą, VSalerno, LSiracusa, MACagnotto, ASalmona, MRomeo, G Design and synthesis of new homo and hetero bis-piperazinyl-1-propanone derivatives as 5-HT7R selective ligands over 5-HT1AR. Bioorg Med Chem Lett26:4052-6 (2016) 
 
5-hydroxytryptamine receptor 1A
Name:5-hydroxytryptamine receptor 1A
Type:n/a
Mol. Mass.:46122.49
Organism:Homo sapiens (Human)
Description:n/a
Residue:422
BDBM10755
NameBDBM10755
Synonyms:14C-5-hydroxy tryptamine creatinine disulfate 5-HT 5-hydroxy tryptamine creatinine disulfate Serotonin | [3H]-5-HT
TypeSmall organic molecule
Emp. Form.C10H12N2O
Mol. Mass.176.2151
SMILESNCCc1c[nH]c2ccc(O)cc12