Reaction Details
Target5-hydroxytryptamine receptor 1A
LigandBDBM50088690
Substrate/Competitorn/a
Meas. Tech.ChEBML_1153
Ki 1.5±n/a nM
Citation Modica, MSantagati, MSantagati, ARusso, FCagnotto, AGoegan, MMennini, T High potent and selective arylpiperazine derivatives as ligands for the 5-HT1A receptor. Bioorg Med Chem Lett10:1089-92 (2000) 5-hydroxytryptamine receptor 1A
Name:5-hydroxytryptamine receptor 1A
Type:G Protein-Coupled Receptor (GPCR)
Mol. Mass.:46445.29
Organism:Rattus norvegicus (rat)
Description:Binding assays were performed using rat hippocampal membranes.
Residue:422
BDBM50088690
NameBDBM50088690
Synonyms:3-Amino-5,6-dimethyl-2-{3-[4-(2-nitro-phenyl)-piperazin-1-yl]-propylsulfanyl}-3H-thieno[2,3-d]pyrimidin-4-one | CHEMBL276617
TypeSmall organic molecule
Emp. Form.C21H26N6O3S2
Mol. Mass.474.6
SMILESCc1sc2nc(SCCCN3CCN(CC3)c3ccccc3[N+]([O-])=O)n(N)c(=O)c2c1C