Reaction Details
TargetMu-type opioid receptor
LigandBDBM50088712
Substrate/Competitorn/a
Meas. Tech.ChEBML_148989
Ki 172±n/a nM
Citation Boyd, RECarson, JRCodd, EEGauthier, ADNeilson, LAZhang, SP Synthesis and binding affinities of 4-diarylaminotropanes, a new class of delta opioid agonists. Bioorg Med Chem Lett10:1109-11 (2000) Mu-type opioid receptor
Name:Mu-type opioid receptor
Type:G Protein-Coupled Receptor (GPCR)
Mol. Mass.:44503.11
Organism:Rattus norvegicus (rat)
Description:Competition binding assays were carried out using membrane preparations from transfected HN9.10 cells that constitutively expressed the mu opioid receptor.
Residue:398
BDBM50088712
NameBDBM50088712
Synonyms:4-{[(1S,3S,5R)-8-(Benzo[1,3]dioxole-5-carbonyl)-8-aza-bicyclo[3.2.1]oct-3-yl]-phenyl-amino}-N,N-diethyl-benzamide | CHEMBL13479
TypeSmall organic molecule
Emp. Form.C32H35N3O4
Mol. Mass.525.638
SMILESCCN(CC)C(=O)c1ccc(cc1)N([C@H]1C[C@@H]2CC[C@H](C1)N2C(=O)c1ccc2OCOc2c1)c1ccccc1