Reaction Details
Target5-hydroxytryptamine receptor 1B
LigandBDBM50088867
Substrate/Competitorn/a
Meas. Tech.ChEBML_1361
Ki 23±n/a nM
Citation Meng, CQRakhit, SLee, DKKamboj, RMcCallum, KLMazzocco, LDyne, KSlassi, A 5-Thienyltryptamine derivatives as serotonin 5-HT1B/1D receptor agonists: potential treatments for migraine. Bioorg Med Chem Lett10:903-5 (2000) 5-hydroxytryptamine receptor 1B
Name:5-hydroxytryptamine receptor 1B
Type:G Protein-Coupled Receptor (GPCR)
Mol. Mass.:43579.17
Organism:Homo sapiens (Human)
Description:Receptor binding assays were performed using human clone stably expressed in CHO cells
Residue:390
BDBM50088867
NameBDBM50088867
Synonyms:CHEMBL170192 | Dimethyl-[2-(5-thiophen-2-yl-1H-indol-3-yl)-ethyl]-amine
TypeSmall organic molecule
Emp. Form.C16H18N2S
Mol. Mass.270.393
SMILESCN(C)CCc1c[nH]c2ccc(cc12)-c1cccs1