Reaction Details
Target5-hydroxytryptamine receptor 1D
LigandBDBM50088866
Substrate/Competitorn/a
Meas. Tech.ChEBML_1733
Ki 3.2±n/a nM
Citation Meng, CQRakhit, SLee, DKKamboj, RMcCallum, KLMazzocco, LDyne, KSlassi, A 5-Thienyltryptamine derivatives as serotonin 5-HT1B/1D receptor agonists: potential treatments for migraine. Bioorg Med Chem Lett10:903-5 (2000) 5-hydroxytryptamine receptor 1D
Name:5-hydroxytryptamine receptor 1D
Type:G Protein-Coupled Receptor (GPCR)
Mol. Mass.:41920.63
Organism:Homo sapiens (Human)
Description:Receptor binding assays were performed using human clone stably expressed in CHO cells.
Residue:377
BDBM50088866
NameBDBM50088866
Synonyms:CHEMBL174355 | Dimethyl-{2-[5-(5-methyl-thiophen-2-yl)-1H-indol-3-yl]-ethyl}-amine
TypeSmall organic molecule
Emp. Form.C17H20N2S
Mol. Mass.284.419
SMILESCN(C)CCc1c[nH]c2ccc(cc12)-c1ccc(C)s1