Reaction Details
TargetIntegrin alpha-4
LigandBDBM50089019
Substrate/Competitorn/a
Meas. Tech.ChEBML_214670
IC50 0.500000±n/a nM
Citation Tilley, JKaplan, GFotouhi, NWolitzky, BRowan, K Carbacyclic peptide mimetics as VCAM-VLA-4 antagonists. Bioorg Med Chem Lett10:1163-5 (2000) Integrin alpha-4
Name:Integrin alpha-4
Type:Membrane Protein
Mol. Mass.:114897.35
Organism:Homo sapiens (Human)
Description:P13612
Residue:1032
BDBM50089019
NameBDBM50089019
Synonyms:(8R,13R)-13-[(S)-2-Amino-3-(4-hydroxy-phenyl)-propionylamino]-6,14-dioxo-10,11-dithia-7,15-diaza-spiro[4.12]heptadecane-8-carboxylic acid | CHEMBL278199
TypeSmall organic molecule
Emp. Form.C23H32N4O6S2
Mol. Mass.524.653
SMILESN[C@@H](Cc1ccc(O)cc1)C(=O)N[C@H]1CSSC[C@H](NC(=O)C2(CCCC2)CCNC1=O)C(O)=O