Reaction Details
TargetGastrin-releasing peptide receptor
LigandBDBM50089288
Substrate/Competitorn/a
Meas. Tech.ChEMBL_39236 (CHEMBL655732)
Ki 300±n/a nM
Citation Cristau, MDevin, COiry, CChaloin, OAmblard, MBernad, NHeitz, AFehrentz, JAMartinez, J Synthesis and biological evaluation of bombesin constrained analogues. J Med Chem43:2356-61 (2000) Gastrin-releasing peptide receptor
Name:Gastrin-releasing peptide receptor
Type:Enzyme Catalytic Domain
Mol. Mass.:43227.55
Organism:RAT
Description:Gastrin-Releasing peptide 0 RAT::P52500
Residue:384
BDBM50089288
NameBDBM50089288
Synonyms:Bombesin analogues | CHEMBL415022
TypeSmall organic molecule
Emp. Form.C53H69N13O9
Mol. Mass.1032.1967
SMILESCC(C)C[C@H](NC(=O)[C@H](CC(C)C)NC(=O)[C@H](Cc1cnc[nH]1)NC(=O)c1cccc(NC(=O)[C@H](C)NC(=O)[C@H](Cc2c[nH]c3ccccc23)NC(=O)[C@H](CCC(N)=O)NC(=O)[C@@H](N)Cc2ccccc2)c1)C(N)=O