Reaction Details
TargetGastrin-releasing peptide receptor
LigandBDBM50089280
Substrate/Competitorn/a
Meas. Tech.ChEMBL_39236 (CHEMBL655732)
Ki 1.7±n/a nM
Citation Cristau, MDevin, COiry, CChaloin, OAmblard, MBernad, NHeitz, AFehrentz, JAMartinez, J Synthesis and biological evaluation of bombesin constrained analogues. J Med Chem43:2356-61 (2000) Gastrin-releasing peptide receptor
Name:Gastrin-releasing peptide receptor
Type:Enzyme Catalytic Domain
Mol. Mass.:43227.55
Organism:RAT
Description:Gastrin-Releasing peptide 0 RAT::P52500
Residue:384
BDBM50089280
NameBDBM50089280
Synonyms:CHEMBL437655 | JMV 1535
TypeSmall organic molecule
Emp. Form.C54H76N14O10
Mol. Mass.1081.269
SMILESCC(C)CC(NC(=O)C(CC(C)C)NC(=O)C(Cc1cnc[nH]1)NC(=O)CN1CCCCC(NC(=O)C(C)NC(=O)C(Cc2c[nH]c3ccccc23)NC(=O)C(CCC(N)=O)NC(=O)[C@H](N)Cc2ccccc2)C1=O)C(N)=O