Reaction Details
TargetAldo-keto reductase family 1 member A1
LigandBDBM16512
Substrate/Competitorn/a
Meas. Tech.ChEMBL_31306 (CHEMBL646324)
IC50 1200±n/a nM
Citation Oka, MMatsumoto, YSugiyama, STsuruta, NMatsushima, M A potent aldose reductase inhibitor, (2S,4S)-6-fluoro-2', 5'-dioxospiro[chroman-4,4'-imidazolidine]-2-carboxamide (Fidarestat): its absolute configuration and interactions with the aldose reductase by X-ray crystallography. J Med Chem43:2479-83 (2000) Aldo-keto reductase family 1 member A1
Name:Aldo-keto reductase family 1 member A1
Type:Enzyme
Mol. Mass.:36574.11
Organism:Homo sapiens (Human)
Description:n/a
Residue:325
BDBM16512
NameBDBM16512
Synonyms:(2S,4S)-6-fluoro-2',5'-dioxo-2,3-dihydrospiro[1-benzopyran-4,4'-imidazolidine]-2-carboxamide CHEMBL84446 Fidarestat (1)
TypeSmall organic molecule
Emp. Form.C12H10FN3O4
Mol. Mass.279.2239
SMILESNC(=O)[C@@H]1C[C@]2(NC(=O)NC2=O)c2cc(F)ccc2O1