Reaction Details
TargetD(3) dopamine receptor
LigandBDBM50533791
Substrate/Competitorn/a
Meas. Tech.ChEMBL_1927262 (CHEMBL4430334)
Ki 0.780000±n/a nM
Citation Luo, DSharma, HYedlapudi, DAntonio, TReith, MEADutta, AK Novel multifunctional dopamine D Bioorg Med Chem24:5088-5102 (2016) 
 
D(3) dopamine receptor
Name:D(3) dopamine receptor
Type:Protein
Mol. Mass.:49540.58
Organism:Rattus norvegicus (Rat)
Description:P19020
Residue:446
BDBM50533791
NameBDBM50533791
Synonyms:CHEMBL4466245
TypeSmall organic molecule
Emp. Form.C21H31N3O2S
Mol. Mass.389.555
SMILESCCCN(CCCCCc1cc(O)ccc1O)[C@H]1CCc2nc(N)sc2C1