Reaction Details
TargetD(3) dopamine receptor
LigandBDBM50533794
Substrate/Competitorn/a
Meas. Tech.ChEMBL_1927262 (CHEMBL4430334)
Ki 16±n/a nM
Citation Luo, DSharma, HYedlapudi, DAntonio, TReith, MEADutta, AK Novel multifunctional dopamine D Bioorg Med Chem24:5088-5102 (2016) 
 
D(3) dopamine receptor
Name:D(3) dopamine receptor
Type:Protein
Mol. Mass.:49540.58
Organism:Rattus norvegicus (Rat)
Description:P19020
Residue:446
BDBM50533794
NameBDBM50533794
Synonyms:CHEMBL4549004
TypeSmall organic molecule
Emp. Form.C20H29N3O2S
Mol. Mass.375.528
SMILESCCCN(CCCc1ccc(O)c(OC)c1)C1CCc2nc(N)sc2C1