Reaction Details
TargetD(3) dopamine receptor
LigandBDBM50533801
Substrate/Competitorn/a
Meas. Tech.ChEMBL_1927262 (CHEMBL4430334)
Ki 0.675000±n/a nM
Citation Luo, DSharma, HYedlapudi, DAntonio, TReith, MEADutta, AK Novel multifunctional dopamine D Bioorg Med Chem24:5088-5102 (2016) 
 
D(3) dopamine receptor
Name:D(3) dopamine receptor
Type:Protein
Mol. Mass.:49540.58
Organism:Rattus norvegicus (Rat)
Description:P19020
Residue:446
BDBM50533801
NameBDBM50533801
Synonyms:CHEMBL4535160
TypeSmall organic molecule
Emp. Form.C23H35N3O2S
Mol. Mass.417.608
SMILESCCCN(CCCCCCc1ccc(O)c(OC)c1)C1CCc2nc(N)sc2C1