Reaction Details
TargetMetabotropic glutamate receptor 4
LigandBDBM50007548
Substrate/Competitorn/a
Meas. Tech.ChEBML_218835
EC50 500±n/a nM
Citation Amori, LCostantino, GMarinozzi, MPellicciari, RGasparini, FFlor, PJKuhn, RVranesic, I Synthesis, molecular modeling and preliminary biological evaluation of 1-amino-3-phosphono-3-cyclopentene-1-carboxylic acid and 1-amino-3-phosphono-2-cyclopentene-1-carboxylic acid, two novel agonists of metabotropic glutamate receptors of group III. Bioorg Med Chem Lett10:1447-50 (2000) Metabotropic glutamate receptor 4
Name:Metabotropic glutamate receptor 4
Type:Protein
Mol. Mass.:101899.95
Organism:Homo sapiens (Human)
Description:Q14833
Residue:912
BDBM50007548
NameBDBM50007548
Synonyms:(S)-2-Amino-4-phosphono-butyric acid 2-Amino-3-(3,5-dioxo-[1,2,4]oxadiazolidin-2-yl)-propionic acid 2-Amino-4-phosphono-butyric acid(S-AP4) 2-amino-4-phosphonobutyric acid L-(+)-2-amino-4-phosphonobutyric acid L-AP4 | L-APB
TypeSmall organic molecule
Emp. Form.C4H10NO5P
Mol. Mass.183.0997
SMILESN[C@@H](CCP(O)(O)=O)C(O)=O