Reaction Details
TargetGABA-A receptor; alpha-2/beta-3/gamma-2
LigandBDBM50089761
Substrate/Competitorn/a
Meas. Tech.ChEMBL_70249 (CHEMBL682708)
Ki 19±n/a nM
Citation Collins, IDavey, WBRowley, MQuirk, KBromidge, FAMcKernan, RMThompson, SAWafford, KA N-(indol-3-ylglyoxylyl)piperidines: high affinity agonists of human GABA-A receptors containing the alpha1 subunit. Bioorg Med Chem Lett10:1381-4 (2000) GABA-A receptor; alpha-2/beta-3/gamma-2
Name:GABA-A receptor; alpha-2/beta-3/gamma-2
Type:n/a
Mol. Mass.:n/a
Description:ASSAY_ID of ChEMBL is 2148174
Components:This complex has 3 components.
Component 1
Name:Gamma-aminobutyric acid receptor subunit gamma-2
Synonyms:GABA(A) receptor subunit gamma-2 GBRG2_HUMAN
Type:PROTEIN
Mol. Mass.:54172.74
Organism:Homo sapiens (Human)
Description:EBI_217
Residue:467
Component 2
Name:Gamma-aminobutyric acid receptor subunit beta-3
Synonyms:GABA A receptor alpha-4/beta-3/gamma-2 GABA-A receptor GBRB3_HUMAN | agonist GABA site
Type:PROTEIN
Mol. Mass.:54130.51
Organism:Homo sapiens (Human)
Description:ChEMBL_448071
Residue:473
Component 3
Name:Gamma-aminobutyric acid receptor subunit alpha-2
Synonyms:GABA receptor alpha-2 subunit GBRA2_HUMAN | Gamma-aminobutyric acid receptor subunit alpha-2 (GABRA2)
Type:Protein
Mol. Mass.:51338.78
Organism:Homo sapiens (Human)
Description:P47869
Residue:451
BDBM50089761
NameBDBM50089761
Synonyms:(R)-1-[2-(1H-Indol-3-yl)-2-oxo-acetyl]-piperidine-3-carboxylic acid benzyl-methyl-amide | CHEMBL28730
TypeSmall organic molecule
Emp. Form.C24H25N3O3
Mol. Mass.403.4736
SMILESCN(Cc1ccccc1)C(=O)[C@@H]1CCCN(C1)C(=O)C(=O)c1c[nH]c2ccccc12