Reaction Details
TargetMuscarinic acetylcholine receptor M2
LigandBDBM50064609
Substrate/Competitorn/a
Meas. Tech.ChEMBL_139771 (CHEMBL747481)
Ki 2.6±n/a nM
Citation Daly, JWGupta, THPadgett, WLPei, XF 6beta-Acyloxy(nor)tropanes: affinities for antagonist/agonist binding sites on transfected and native muscarinic receptors. J Med Chem43:2514-22 (2000) Muscarinic acetylcholine receptor M2
Name:Muscarinic acetylcholine receptor M2
Type:GPCR
Mol. Mass.:51730.61
Organism:Homo sapiens (Human)
Description:P08172
Residue:466
BDBM50064609
NameBDBM50064609
Synonyms:6-acetoxy-8-azonia-bicyclo[3.2.1]octane CHEMBL64000
TypeSmall organic molecule
Emp. Form.C9H15NO2
Mol. Mass.169.2209
SMILESCC(=O)OC1CC2CCCC1N2