Reaction Details
TargetAlpha-1A adrenergic receptor
LigandBDBM50090026
Substrate/Competitorn/a
Meas. Tech.ChEMBL_33736 (CHEMBL647052)
Ki 20±n/a nM
Citation Barrow, JCNantermet, PGSelnick, HGGlass, KLRittle, KEGilbert, KFSteele, TGHomnick, CFFreidinger, RMRansom, RWKling, PReiss, DBroten, TPSchorn, TWChang, RSO'Malley, SSOlah, TVEllis, JDBarrish, AKassahun, KLeppert, PNagarathnam, DForray, C In vitro and in vivo evaluation of dihydropyrimidinone C-5 amides as potent and selective alpha(1A) receptor antagonists for the treatment of benign prostatic hyperplasia. J Med Chem43:2703-18 (2000) Alpha-1A adrenergic receptor
Name:Alpha-1A adrenergic receptor
Type:Cell-surface receptors
Mol. Mass.:51511.67
Organism:Homo sapiens (Human)
Description:P35348
Residue:466
BDBM50090026
NameBDBM50090026
Synonyms:(S)-4-(3,4-Difluoro-phenyl)-1,6-dimethyl-2-oxo-1,2,3,4-tetrahydro-pyrimidine-5-carboxylic acid {3-[4-(4-fluoro-phenyl)-piperidin-1-yl]-propyl}-amide | CHEMBL328268
TypeSmall organic molecule
Emp. Form.C27H31F3N4O2
Mol. Mass.500.5558
SMILESCN1C(=O)N[C@H](C(C(=O)NCCCN2CCC(CC2)c2ccc(F)cc2)=C1C)c1ccc(F)c(F)c1