Reaction Details
TargetAlpha-1D adrenergic receptor
LigandBDBM50090023
Substrate/Competitorn/a
Meas. Tech.ChEMBL_32450 (CHEMBL643398)
Ki 62±n/a nM
Citation Barrow, JCNantermet, PGSelnick, HGGlass, KLRittle, KEGilbert, KFSteele, TGHomnick, CFFreidinger, RMRansom, RWKling, PReiss, DBroten, TPSchorn, TWChang, RSO'Malley, SSOlah, TVEllis, JDBarrish, AKassahun, KLeppert, PNagarathnam, DForray, C In vitro and in vivo evaluation of dihydropyrimidinone C-5 amides as potent and selective alpha(1A) receptor antagonists for the treatment of benign prostatic hyperplasia. J Med Chem43:2703-18 (2000) Alpha-1D adrenergic receptor
Name:Alpha-1D adrenergic receptor
Type:Enzyme Catalytic Domain
Mol. Mass.:60485.82
Organism:Homo sapiens (Human)
Description:adrenergic Alpha1D ADRA1D HUMAN::P25100
Residue:572
BDBM50090023
NameBDBM50090023
Synonyms:4-(3,4-Difluoro-phenyl)-2-oxo-1,2,3,4-tetrahydro-pyrimidine-5-carboxylic acid {3-[4-(2-cyano-4-fluoro-phenyl)-piperidin-1-yl]-propyl}-amide | CHEMBL94188
TypeSmall organic molecule
Emp. Form.C26H26F3N5O2
Mol. Mass.497.5121
SMILESFc1ccc(C2CCN(CCCNC(=O)C3C=NC(=O)N[C@@H]3c3ccc(F)c(F)c3)CC2)c(c1)C#N