Reaction Details
TargetAlpha-1B adrenergic receptor
LigandBDBM50090011
Substrate/Competitorn/a
Meas. Tech.ChEMBL_34327 (CHEMBL648110)
Ki 85±n/a nM
Citation Barrow, JCNantermet, PGSelnick, HGGlass, KLRittle, KEGilbert, KFSteele, TGHomnick, CFFreidinger, RMRansom, RWKling, PReiss, DBroten, TPSchorn, TWChang, RSO'Malley, SSOlah, TVEllis, JDBarrish, AKassahun, KLeppert, PNagarathnam, DForray, C In vitro and in vivo evaluation of dihydropyrimidinone C-5 amides as potent and selective alpha(1A) receptor antagonists for the treatment of benign prostatic hyperplasia. J Med Chem43:2703-18 (2000) Alpha-1B adrenergic receptor
Name:Alpha-1B adrenergic receptor
Type:Enzyme
Mol. Mass.:56862.13
Organism:Homo sapiens (Human)
Description:P35368
Residue:520
BDBM50090011
NameBDBM50090011
Synonyms:(S)-4-(3,4-Difluoro-phenyl)-1,3,6-trimethyl-2-oxo-1,2,3,4-tetrahydro-pyrimidine-5-carboxylic acid {3-[4-(4-fluoro-phenyl)-piperidin-1-yl]-propyl}-amide | CHEMBL93693
TypeSmall organic molecule
Emp. Form.C28H33F3N4O2
Mol. Mass.514.5824
SMILESCN1[C@H](C(C(=O)NCCCN2CCC(CC2)c2ccc(F)cc2)=C(C)N(C)C1=O)c1ccc(F)c(F)c1