Reaction Details
TargetAlpha-1B adrenergic receptor
LigandBDBM50090015
Substrate/Competitorn/a
Meas. Tech.ChEMBL_34456 (CHEMBL651988)
Ki 87±n/a nM
Citation Barrow, JCNantermet, PGSelnick, HGGlass, KLRittle, KEGilbert, KFSteele, TGHomnick, CFFreidinger, RMRansom, RWKling, PReiss, DBroten, TPSchorn, TWChang, RSO'Malley, SSOlah, TVEllis, JDBarrish, AKassahun, KLeppert, PNagarathnam, DForray, C In vitro and in vivo evaluation of dihydropyrimidinone C-5 amides as potent and selective alpha(1A) receptor antagonists for the treatment of benign prostatic hyperplasia. J Med Chem43:2703-18 (2000) Alpha-1B adrenergic receptor
Name:Alpha-1B adrenergic receptor
Type:Enzyme
Mol. Mass.:56862.13
Organism:Homo sapiens (Human)
Description:P35368
Residue:520
BDBM50090015
NameBDBM50090015
Synonyms:4-(3,4-Difluoro-phenyl)-6-methyl-2-oxo-1,2,3,4-tetrahydro-pyrimidine-5-carboxylic acid {3-[4-(2-cyano-4-fluoro-phenyl)-piperidin-1-yl]-propyl}-amide | CHEMBL92328
TypeSmall organic molecule
Emp. Form.C27H28F3N5O2
Mol. Mass.511.5387
SMILESCC1=NC(=O)N[C@@H](C1C(=O)NCCCN1CCC(CC1)c1ccc(F)cc1C#N)c1ccc(F)c(F)c1