Reaction Details
TargetAlpha-1A adrenergic receptor
LigandBDBM50090028
Substrate/Competitorn/a
Meas. Tech.ChEMBL_33736 (CHEMBL647052)
Ki 0.6±n/a nM
Citation Barrow, JCNantermet, PGSelnick, HGGlass, KLRittle, KEGilbert, KFSteele, TGHomnick, CFFreidinger, RMRansom, RWKling, PReiss, DBroten, TPSchorn, TWChang, RSO'Malley, SSOlah, TVEllis, JDBarrish, AKassahun, KLeppert, PNagarathnam, DForray, C In vitro and in vivo evaluation of dihydropyrimidinone C-5 amides as potent and selective alpha(1A) receptor antagonists for the treatment of benign prostatic hyperplasia. J Med Chem43:2703-18 (2000) Alpha-1A adrenergic receptor
Name:Alpha-1A adrenergic receptor
Type:Cell-surface receptors
Mol. Mass.:51511.67
Organism:Homo sapiens (Human)
Description:P35348
Residue:466
BDBM50090028
NameBDBM50090028
Synonyms:4-(3,4-Difluoro-phenyl)-1,6-dimethyl-2-oxo-1,2,3,4-tetrahydro-pyrimidine-5-carboxylic acid {3-[4-cyano-4-(2-cyano-4-fluoro-phenyl)-piperidin-1-yl]-propyl}-amide | CHEMBL91403
TypeSmall organic molecule
Emp. Form.C29H29F3N6O2
Mol. Mass.550.5748
SMILESCN1C(=O)N[C@@H](C(C(=O)NCCCN2CCC(CC2)(C#N)c2ccc(F)cc2C#N)=C1C)c1ccc(F)c(F)c1