Reaction Details
TargetAlpha-1A adrenergic receptor
LigandBDBM50090037
Substrate/Competitorn/a
Meas. Tech.ChEMBL_33736 (CHEMBL647052)
Ki 0.42±n/a nM
Citation Barrow, JCNantermet, PGSelnick, HGGlass, KLRittle, KEGilbert, KFSteele, TGHomnick, CFFreidinger, RMRansom, RWKling, PReiss, DBroten, TPSchorn, TWChang, RSO'Malley, SSOlah, TVEllis, JDBarrish, AKassahun, KLeppert, PNagarathnam, DForray, C In vitro and in vivo evaluation of dihydropyrimidinone C-5 amides as potent and selective alpha(1A) receptor antagonists for the treatment of benign prostatic hyperplasia. J Med Chem43:2703-18 (2000) Alpha-1A adrenergic receptor
Name:Alpha-1A adrenergic receptor
Type:Cell-surface receptors
Mol. Mass.:51511.67
Organism:Homo sapiens (Human)
Description:P35348
Residue:466
BDBM50090037
NameBDBM50090037
Synonyms:4-(3,4-Difluoro-phenyl)-6-methoxymethyl-2-oxo-1,2,3,4-tetrahydro-pyrimidine-5-carboxylic acid {3-[4-(2-cyano-phenyl)-piperidin-1-yl]-propyl}-amide | CHEMBL327716
TypeSmall organic molecule
Emp. Form.C28H31F2N5O3
Mol. Mass.523.5742
SMILESCOCC1=NC(=O)N[C@@H](C1C(=O)NCCCN1CCC(CC1)c1ccccc1C#N)c1ccc(F)c(F)c1