Reaction Details
TargetKappa-type opioid receptor
LigandBDBM50090102
Substrate/Competitorn/a
Meas. Tech.ChEMBL_145814 (CHEMBL753526)
Ki 0.226±n/a nM
Citation Stevens, WCJones, RMSubramanian, GMetzger, TGFerguson, DMPortoghese, PS Potent and selective indolomorphinan antagonists of the kappa-opioid receptor. J Med Chem43:2759-69 (2000) Kappa-type opioid receptor
Name:Kappa-type opioid receptor
Type:G Protein-Coupled Receptor (GPCR)
Mol. Mass.:42692.90
Organism:Rattus norvegicus (rat)
Description:P34975
Residue:380
BDBM50090102
NameBDBM50090102
Synonyms:5'-N-Biguanidino-17-cyclopropylmethyl-6,7-didehydro-4,5alpha-epoxy-3,14-dihydroxyindolo[2',3':6,7]morphinan | CHEMBL92917
TypeSmall organic molecule
Emp. Form.C28H31N7O3
Mol. Mass.513.5908
SMILESNC(=N)N=C(N)Nc1ccc2[nH]c3[C@@H]4Oc5c6c(CC7N(CC8CC8)CC[C@@]46[C@@]7(O)Cc3c2c1)ccc5O