Reaction Details
TargetThromboxane A2 receptor
LigandBDBM50035622
Substrate/Competitorn/a
Meas. Tech.ChEMBL_210260 (CHEMBL883488)
EC50 1400±n/a nM
Citation deLong, MAAmburgey, JTaylor, CWos, JASoper, DLWang, YHicks, R Synthesis and in vitro evaluation of human FP-receptor selective prostaglandin analogues. Bioorg Med Chem Lett10:1519-22 (2000) Thromboxane A2 receptor
Name:Thromboxane A2 receptor
Type:Enyzme
Mol. Mass.:37445.28
Organism:Homo sapiens (Human)
Description:P21731
Residue:343
BDBM50035622
NameBDBM50035622
Synonyms:(5Z,13E,15S)-9alpha,11alpha,15-trihydroxyprosta-5,13-dien-1-oic acid DINOPROST l-PGF2-alpha prostaglandin F2alpha
TypeSmall organic molecule
Emp. Form.C20H34O5
Mol. Mass.354.481
SMILESCCCCC[C@H](O)\C=C\[C@H]1[C@H](O)C[C@H](O)[C@@H]1C\C=C/CCCC(O)=O